{"text_format":"1","workbook":"xlsx","n_sheets":6,"sheets":["System Calculation","SC_Loop 1","SC_Loop 2","External power supply","Data","Translations"],"not_rendered":{"charts":0,"images":3,"macros":1,"external_links":0,"defined_names":22,"comments":0,"pivot_tables":0},"unopened":[],"bounds":{"document_bytes":16777216,"sheet_cells":100000,"rows_first":2000,"rows_last":500,"rows_between":2000,"halvings":0,"cell_chars":16384,"cell_head_chars":4096},"cells_cut":0,"cells_raw":0,"read":"whole","date_system":"1900"}

{"sheet":"System Calculation","index":0,"n_rows":40,"n_cols":12,"rows_kept":40,"cut":false,"hidden":false,"merged":[[39,0,39,11],[9,7,9,8],[11,7,12,9],[25,0,27,0],[9,0,9,2],[13,0,13,2]]}
[]
[]
[]
[]
[null,null,null,null,{"$f":"VLOOKUP(\"Pulsar botón para reiniciar todos los valores e iniciar un nuevo proyecto\", Translations!$A$2:$E$209, MATCH($J$7, Translations!$A$1:$E$1, 0), FALSE)","v":"Press the button to reset all the values and start a new project"}]
[]
["SYSTEM CALCULATOR DETNOV CAD-151",null,null,null,null,null,null,null,{"$f":"VLOOKUP(\"Idioma\", Translations!$A$2:$E$209, MATCH($J$7, Translations!$A$1:$E$1, 0), FALSE)","v":"Language"},"English",null,"SC 688 m 2025 b"]
[]
[]
[{"$f":"VLOOKUP(\"Tiempo respaldo baterías\", Translations!$A$4:$E$209, MATCH($J$7, Translations!$A$1:$E$1, 0), FALSE)","v":"Battery backup time"},null,null,null,null,null,null,{"$f":"VLOOKUP(\"Máximo nº sirenas en alarma simultánea\", Translations!$A$4:$E$209, MATCH($J$7, Translations!$A$1:$E$1, 0), FALSE)","v":"Maximum sounders in alarm at the same time"}]
[{"$f":"VLOOKUP(\"Tiempo en reposo\", Translations!$A$4:$E$209, MATCH($J$7, Translations!$A$1:$E$1, 0), FALSE)","v":"Standby time"},null,"h",{"$f":"VLOOKUP(\"Seleccionar tiempo en reposo\", Translations!$A$4:$E$209, MATCH($J$7, Translations!$A$1:$E$1, 0), FALSE)","v":"Select standby time"},null,null,null,{"$f":"VLOOKUP(\"Sirenas\", Translations!$A$4:$E$209, MATCH($J$7, Translations!$A$1:$E$1, 0), FALSE)","v":"Sounders"}]
[{"$f":"VLOOKUP(\"Tiempo en alarma\", Translations!$A$4:$E$209, MATCH($J$7, Translations!$A$1:$E$1, 0), FALSE)","v":"Alarm time"},null,"min",{"$f":"VLOOKUP(\"Seleccionar tiempo en alarma\", Translations!$A$4:$E$209, MATCH($J$7, Translations!$A$1:$E$1, 0), FALSE)","v":"Select alarm time"},null,null,null,{"$f":"VLOOKUP(\"Cumplimentar el campo para el máximo % de sirenas en alarma al mismo tiempo (campo amarillo)\", Translations!$A$4:$E$209, MATCH($J$7, Translations!$A$1:$E$1, 0), FALSE)","v":"Fill the field for the maximum % of sounders in alarm at the same time"}]
[null,{"$f":"IF(OR(B11=48,B11=24),VLOOKUP(\"Nota: los valores seleccionados no cumplen EN 54\", Translations!$A$4:$E$209, MATCH($J$7, Translations!$A$1:$E$1, 0), FALSE),\" \")","v":" "}]
[{"$f":"VLOOKUP(\"Parámetros del sistema y baterías\", Translations!$A$4:$E$209, MATCH($J$7, Translations!$A$1:$E$1, 0), FALSE)","v":"Battery and system parameters"},null,null,{"$f":"IF(A15<>\" \",VLOOKUP(A15,Data!B4:F17,5,0),0)","v":{"$error":"#N/A"}}]
[null,{"$f":"IF(A15<>\" \",VLOOKUP(A15,Data!B4:D17,2,0),0)","v":{"$error":"#N/A"}},{"$f":"IF(A15<>\" \",VLOOKUP(A15,Data!B4:D17,3,0),0)","v":{"$error":"#N/A"}},{"$f":"VLOOKUP(\"Seleccionar central de la lista\", Translations!$A$4:$E$209, MATCH($J$7, Translations!$A$1:$E$1, 0), FALSE)","v":"Select control panel from the list"}]
{"$rows_left_out":26}
{"sheet":"SC_Loop 1","index":1,"n_rows":114,"n_cols":31,"rows_kept":114,"cut":false,"hidden":false,"merged":[[113,0,113,13],[9,11,9,12],[10,11,10,12],[8,11,8,13],[9,8,10,10],[11,3,12,12]]}
[]
[]
[]
[]
[{"$f":"'System Calculation'!A7","v":"SYSTEM CALCULATOR DETNOV CAD-151"},null,null,null,null,null,null,null,null,null,null,null,null,{"$f":"'System Calculation'!L7","v":"SC 688 m 2025 b"}]
[]
[{"$f":"VLOOKUP(\"Cumplimentar Sección de cable en mm2 y Longitud de lazo en metros (campo amarillo)\",Translations!$A$4:$E$209,MATCH('System Calculation'!$J$7,Translations!$A$1:$E$1,0),FALSE)","v":"Fill Cable cross section in mm2 and Loop length in meters"}]
[{"$f":"VLOOKUP(\"Seleccionar el factor de distribución en el lazo y topología de clase\",Translations!$A$4:$E$209,MATCH('System Calculation'!$J$7,Translations!$A$1:$E$1,0),FALSE)","v":"Select the distribution factor in the loop and the topology"}]
[{"$f":"VLOOKUP(\"Lazo\",Translations!$A$4:$E$209,MATCH('System Calculation'!$J$7,Translations!$A$1:$E$1,0),FALSE)","v":"Loop"},null,null,null,null,null,null,null,null,null,null,{"$f":"VLOOKUP(\"Comprobación sistema\",Translations!$A$4:$E$209,MATCH('System Calculation'!$J$7,Translations!$A$1:$E$1,0),FALSE)","v":"System check"},null,null,null,{"$f":"VLOOKUP(\"Trama comunicaciones\",Translations!$A$4:$E$209,MATCH('System Calculation'!$J$7,Translations!$A$1:$E$1,0),FALSE)","v":"Communication frame"},null,26]
[{"$f":"VLOOKUP(\"Sección de cable\",Translations!$A$4:$E$209,MATCH('System Calculation'!$J$7,Translations!$A$1:$E$1,0),FALSE)","v":"Cable cross section"},null,{"$f":"IFERROR(VLOOKUP($B$10,Data!$H$17:$I$23,2,FALSE),\"ERROR\")","v":"ERROR"},null,null,null,null,null,{"$f":"IF(B11>3500,VLOOKUP(\"Error: La longitud máxima de lazo es 3500 m\",Translations!$A$4:$E$209,MATCH('System Calculation'!$J$7,Translations!$A$1:$E$1,0),FALSE),\"\")","v":""},null,null,{"$f":"VLOOKUP(\"Corriente\",Translations!$A$4:$E$209,MATCH('System Calculation'!$J$7,Translations!$A$1:$E$1,0),FALSE)","v":"Consumption"},null,{"$f":"IFERROR(IF($B$85>0.75,VLOOKUP(\"FALLO\",Translations!$A$4:$E$209,MATCH('System Calculation'!$J$7,Translations!$A$1:$E$1,0),FALSE),IF($B$107>=$B$85,\"OK\",\"FALLO\")),VLOOKUP(\"ERROR\",Translations!$A$4:$E$209,MATCH('System Calculation'!$J$7,Translations!$A$1:$E$1,0),FALSE))","v":"OK"},null,{"$f":"IFERROR(IF($B$85>0.75,VLOOKUP(\"Error: La corriente de lazo es mayor que la corriente máxima permitida\",Translations!$A$4:$E$209,MATCH('System Calculation'!$J$7,Translations!$A$1:$E$1,0),FALSE),IF($B$107<$B$85,VLOOKUP(\"Error: La corriente de lazo es mayor que la corriente máxima permitida\",Translations!$A$4:$E$209,MATCH('System Calculation'!$J$7,Translations!$A$1:$E$1,0),FALSE),\"\")),VLOOKUP(\"ERROR: Los datos no son correctos\",Translations!$A$4:$E$209,MATCH('System Calculation'!$J$7,Translations!$A$1:$E$1,0),FALSE))","v":""}]
[{"$f":"VLOOKUP(\"Longitud de lazo\",Translations!$A$4:$E$209,MATCH('System Calculation'!$J$7,Translations!$A$1:$E$1,0),FALSE)","v":"Loop length"},null,{"$f":"VLOOKUP(\"metros\",Translations!$A$4:$E$209,MATCH('System Calculation'!$J$7,Translations!$A$1:$E$1,0),FALSE)","v":"meters"},null,null,null,null,null,null,null,null,{"$f":"VLOOKUP(\"Direcciones\",Translations!$A$4:$E$209,MATCH('System Calculation'!$J$7,Translations!$A$1:$E$1,0),FALSE)","v":"Directions"},null,{"$f":"IF($N$77<=250,VLOOKUP(\"OK\",Translations!$A$4:$E$209,MATCH('System Calculation'!$J$7,Translations!$A$1:$E$1,0),FALSE),VLOOKUP(\"FALLO\",Translations!$A$4:$E$209,MATCH('System Calculation'!$J$7,Translations!$A$1:$E$1,0),FALSE))","v":"OK"},null,{"$f":"IF($N$77>250,VLOOKUP(\"Error: El lazo no admite más de 250 direcciones\",Translations!$A$4:$E$209,MATCH('System Calculation'!$J$7,Translations!$A$1:$E$1,0),FALSE),\"\")","v":""},null,null,null,null,null,null,null,null,null,{"$f":"VLOOKUP(\"Información\",Translations!$A$4:$E$209,MATCH('System Calculation'!$J$7,Translations!$A$1:$E$1,0),FALSE)","v":"Information"}]
[{"$f":"VLOOKUP(\"Distancia de S al primer dispositivo\",Translations!$A$4:$E$209,MATCH('System Calculation'!$J$7,Translations!$A$1:$E$1,0),FALSE)","v":"Distance from S to first device"},null,{"$f":"VLOOKUP(\"metros\",Translations!$A$4:$E$209,MATCH('System Calculation'!$J$7,Translations!$A$1:$E$1,0),FALSE)","v":"meters"},{"$f":"IF(B12+B13>B11,VLOOKUP(\"La suma de distancias desde la central a los dipositivos no puede ser mayor a la longitud de lazo\",Translations!$A$4:$E$209,MATCH('System Calculation'!$J$7,Translations!$A$1:$E$1,0),FALSE),\" \")","v":" "},null,null,null,null,null,null,null,null,null,null,null,{"$f":"IFERROR(IF(P13<>\"\",VLOOKUP(\"Indicaciones\",Translations!$A$4:$E$209,MATCH('System Calculation'!$J$7,Translations!$A$1:$E$1,0),FALSE),\"\"),VLOOKUP(\"Indicaciones\",Translations!$A$4:$E$209,MATCH('System Calculation'!$J$7,Translations!$A$1:$E$1,0),FALSE))","v":""},null,null,null,null,null,null,null,null,null,{"$f":"VLOOKUP(\"Esta es la distancia de la salida del lazo hasta el primer dispositivo\",Translations!$A$4:$E$209,MATCH('System Calculation'!$J$7,Translations!$A$1:$E$1,0),FALSE)","v":"This is the distance from the S of the loop to the first device"}]
[{"$f":"VLOOKUP(\"Distancia de R al último dispositivo\",Translations!$A$4:$E$209,MATCH('System Calculation'!$J$7,Translations!$A$1:$E$1,0),FALSE)","v":"Distance from R to last device"},null,{"$f":"VLOOKUP(\"metros\",Translations!$A$4:$E$209,MATCH('System Calculation'!$J$7,Translations!$A$1:$E$1,0),FALSE)","v":"meters"},null,null,null,null,null,null,null,null,null,null,null,null,{"$f":"IFERROR(IF($N$77>250,VLOOKUP(\"Reduzca el número de direcciones utilizadas\",Translations!$A$4:$E$209,MATCH('System Calculation'!$J$7,Translations!$A$1:$E$1,0),FALSE),IF($B$85>0.75,VLOOKUP(\"Trate de reducir el consumo ajustando la cantidad de dispositivos\",Translations!$A$4:$E$209,MATCH('System Calculation'!$J$7,Translations!$A$1:$E$1,0),FALSE),IF($B$107<$B$85,VLOOKUP(\"Trate de modificar los parámetros de cable y lazo\",Translations!$A$4:$E$209,MATCH('System Calculation'!$J$7,Translations!$A$1:$E$1,0),FALSE),\"\"))),VLOOKUP(\"Revise o rellene los datos de configuración de lazo\",Translations!$A$4:$E$209,MATCH('System Calculation'!$J$7,Translations!$A$1:$E$1,0),FALSE))","v":""},null,null,null,null,null,null,null,null,null,{"$f":"VLOOKUP(\"Esta es la distancia del último dispositivo al retorno del lazo\",Translations!$A$4:$E$209,MATCH('System Calculation'!$J$7,Translations!$A$1:$E$1,0),FALSE)","v":"This is the distance from the last device to the R of the loop"}]
[{"$f":"VLOOKUP(\"Topología de lazo\",Translations!$A$4:$E$209,MATCH('System Calculation'!$J$7,Translations!$A$1:$E$1,0),FALSE)","v":"Loop topology"},null,{"$f":"IFERROR(VLOOKUP(B14,Data!$D$45:$E$46,2,FALSE),\"ERROR\")","v":"ERROR"},null,{"$f":"IF($B$14=Data!D46,VLOOKUP(\"Lazo abierto. Toda la corriente en el mismo extremo del cable (peor caso)\",Translations!$A$4:$E$209,MATCH('System Calculation'!$J$7,Translations!$A$1:$E$1,0),FALSE),VLOOKUP(\"Lazo cerrado. Se divide la corriente por los dos extremos (mejor caso)\",Translations!$A$4:$E$209,MATCH('System Calculation'!$J$7,Translations!$A$1:$E$1,0),FALSE))","v":"Closed loop. The current is divided on both ends (best case)"},null,null,null,null,null,null,null,null,null,null,null,null,null,null,null,null,null,null,null,null,{"$f":"VLOOKUP(\"La topología de lazo hace referencia\",Translations!$A$4:$E$209,MATCH('System Calculation'!$J$7,Translations!$A$1:$E$1,0),FALSE)","v":"Loop topology takes into account whether the loop is closed in Class A, or the loop is in degraded mode due to an open loop fault "}]
[{"$f":"VLOOKUP(\"Factor de distribución\",Translations!$A$4:$E$209,MATCH('System Calculation'!$J$7,Translations!$A$1:$E$1,0),FALSE)","v":"Distribution factor"},1,{"$f":"VLOOKUP(B15,Data!$A$21:$B$49,2,FALSE)","v":0.56999999999999995},null,{"$f":"IF($B$15=1,VLOOKUP(\"Distribuidos equitativamente (mejor caso)\",Translations!$A$4:$E$209,MATCH('System Calculation'!$J$7,Translations!$A$1:$E$1,0),FALSE),IF($B$15=0,VLOOKUP(\"Todos en el mismo extremo del cable (peor caso)\",Translations!$A$4:$E$209,MATCH('System Calculation'!$J$7,Translations!$A$1:$E$1,0),FALSE),VLOOKUP(\"Caso intermedio\",Translations!$A$4:$E$209,MATCH('System Calculation'!$J$7,Translations!$A$1:$E$1,0),FALSE)))","v":"Equally distributed (best case)"},null,null,null,null,null,null,null,null,null,null,null,null,null,null,null,null,null,null,null,null,{"$f":"VLOOKUP(\"El factor de distribución hace referencia\",Translations!$A$4:$E$209,MATCH('System Calculation'!$J$7,Translations!$A$1:$E$1,0),FALSE)","v":"Distribution factor is an estimation of how equitative are the devices distributed along the loop, being 100% perfectly distributed"}]
{"$rows_left_out":100}
{"sheet":"SC_Loop 2","index":2,"n_rows":114,"n_cols":31,"rows_kept":114,"cut":false,"hidden":false,"merged":[[113,0,113,13],[11,3,12,12],[8,11,8,13],[9,8,10,10],[9,11,9,12],[10,11,10,12]]}
[]
[]
[]
[]
[{"$f":"'System Calculation'!A7","v":"SYSTEM CALCULATOR DETNOV CAD-151"},null,null,null,null,null,null,null,null,null,null,null,null,{"$f":"'System Calculation'!L7","v":"SC 688 m 2025 b"}]
[]
[{"$f":"VLOOKUP(\"Cumplimentar Sección de cable en mm2 y Longitud de lazo en metros (campo amarillo)\",Translations!$A$4:$E$209,MATCH('System Calculation'!$J$7,Translations!$A$1:$E$1,0),FALSE)","v":"Fill Cable cross section in mm2 and Loop length in meters"}]
[{"$f":"VLOOKUP(\"Seleccionar el factor de distribución en el lazo y topología de clase\",Translations!$A$4:$E$209,MATCH('System Calculation'!$J$7,Translations!$A$1:$E$1,0),FALSE)","v":"Select the distribution factor in the loop and the topology"}]
[{"$f":"VLOOKUP(\"Lazo\",Translations!$A$4:$E$209,MATCH('System Calculation'!$J$7,Translations!$A$1:$E$1,0),FALSE)","v":"Loop"},null,null,null,null,null,null,null,null,null,null,{"$f":"VLOOKUP(\"Comprobación sistema\",Translations!$A$4:$E$209,MATCH('System Calculation'!$J$7,Translations!$A$1:$E$1,0),FALSE)","v":"System check"},null,null,null,{"$f":"VLOOKUP(\"Trama comunicaciones\",Translations!$A$4:$E$209,MATCH('System Calculation'!$J$7,Translations!$A$1:$E$1,0),FALSE)","v":"Communication frame"},null,26]
[{"$f":"VLOOKUP(\"Sección de cable\",Translations!$A$4:$E$209,MATCH('System Calculation'!$J$7,Translations!$A$1:$E$1,0),FALSE)","v":"Cable cross section"},null,{"$f":"IFERROR(VLOOKUP($B$10,Data!$H$17:$I$23,2,FALSE),\"ERROR\")","v":"ERROR"},null,null,null,null,null,{"$f":"IF(B11>3500,VLOOKUP(\"Error: La longitud máxima de lazo es 3500 m\",Translations!$A$4:$E$209,MATCH('System Calculation'!$J$7,Translations!$A$1:$E$1,0),FALSE),\"\")","v":""},null,null,{"$f":"VLOOKUP(\"Corriente\",Translations!$A$4:$E$209,MATCH('System Calculation'!$J$7,Translations!$A$1:$E$1,0),FALSE)","v":"Consumption"},null,{"$f":"IFERROR(IF($B$85>0.75,VLOOKUP(\"FALLO\",Translations!$A$4:$E$209,MATCH('System Calculation'!$J$7,Translations!$A$1:$E$1,0),FALSE),IF($B$107>=$B$85,\"OK\",\"FALLO\")),VLOOKUP(\"ERROR\",Translations!$A$4:$E$209,MATCH('System Calculation'!$J$7,Translations!$A$1:$E$1,0),FALSE))","v":"OK"},null,{"$f":"IFERROR(IF($B$85>0.75,VLOOKUP(\"Error: La corriente de lazo es mayor que la corriente máxima permitida\",Translations!$A$4:$E$209,MATCH('System Calculation'!$J$7,Translations!$A$1:$E$1,0),FALSE),IF($B$107<$B$85,VLOOKUP(\"Error: La corriente de lazo es mayor que la corriente máxima permitida\",Translations!$A$4:$E$209,MATCH('System Calculation'!$J$7,Translations!$A$1:$E$1,0),FALSE),\"\")),VLOOKUP(\"ERROR: Los datos no son correctos\",Translations!$A$4:$E$209,MATCH('System Calculation'!$J$7,Translations!$A$1:$E$1,0),FALSE))","v":""}]
[{"$f":"VLOOKUP(\"Longitud de lazo\",Translations!$A$4:$E$209,MATCH('System Calculation'!$J$7,Translations!$A$1:$E$1,0),FALSE)","v":"Loop length"},null,{"$f":"VLOOKUP(\"metros\",Translations!$A$4:$E$209,MATCH('System Calculation'!$J$7,Translations!$A$1:$E$1,0),FALSE)","v":"meters"},null,null,null,null,null,null,null,null,{"$f":"VLOOKUP(\"Direcciones\",Translations!$A$4:$E$209,MATCH('System Calculation'!$J$7,Translations!$A$1:$E$1,0),FALSE)","v":"Directions"},null,{"$f":"IF($N$77<=250,VLOOKUP(\"OK\",Translations!$A$4:$E$209,MATCH('System Calculation'!$J$7,Translations!$A$1:$E$1,0),FALSE),VLOOKUP(\"FALLO\",Translations!$A$4:$E$209,MATCH('System Calculation'!$J$7,Translations!$A$1:$E$1,0),FALSE))","v":"OK"},null,{"$f":"IF($N$77>250,VLOOKUP(\"Error: El lazo no admite más de 250 direcciones\",Translations!$A$4:$E$209,MATCH('System Calculation'!$J$7,Translations!$A$1:$E$1,0),FALSE),\"\")","v":""},null,null,null,null,null,null,null,null,null,{"$f":"VLOOKUP(\"Información\",Translations!$A$4:$E$209,MATCH('System Calculation'!$J$7,Translations!$A$1:$E$1,0),FALSE)","v":"Information"}]
[{"$f":"VLOOKUP(\"Distancia de S al primer dispositivo\",Translations!$A$4:$E$209,MATCH('System Calculation'!$J$7,Translations!$A$1:$E$1,0),FALSE)","v":"Distance from S to first device"},null,{"$f":"VLOOKUP(\"metros\",Translations!$A$4:$E$209,MATCH('System Calculation'!$J$7,Translations!$A$1:$E$1,0),FALSE)","v":"meters"},{"$f":"IF(B12+B13>B11,VLOOKUP(\"La suma de distancias desde la central a los dipositivos no puede ser mayor a la longitud de lazo\",Translations!$A$4:$E$209,MATCH('System Calculation'!$J$7,Translations!$A$1:$E$1,0),FALSE),\" \")","v":" "},null,null,null,null,null,null,null,null,null,null,null,{"$f":"IFERROR(IF(P13<>\"\",VLOOKUP(\"Indicaciones\",Translations!$A$4:$E$209,MATCH('System Calculation'!$J$7,Translations!$A$1:$E$1,0),FALSE),\"\"),VLOOKUP(\"Indicaciones\",Translations!$A$4:$E$209,MATCH('System Calculation'!$J$7,Translations!$A$1:$E$1,0),FALSE))","v":""},null,null,null,null,null,null,null,null,null,{"$f":"VLOOKUP(\"Esta es la distancia de la salida del lazo hasta el primer dispositivo\",Translations!$A$4:$E$209,MATCH('System Calculation'!$J$7,Translations!$A$1:$E$1,0),FALSE)","v":"This is the distance from the S of the loop to the first device"}]
[{"$f":"VLOOKUP(\"Distancia de R al último dispositivo\",Translations!$A$4:$E$209,MATCH('System Calculation'!$J$7,Translations!$A$1:$E$1,0),FALSE)","v":"Distance from R to last device"},null,{"$f":"VLOOKUP(\"metros\",Translations!$A$4:$E$209,MATCH('System Calculation'!$J$7,Translations!$A$1:$E$1,0),FALSE)","v":"meters"},null,null,null,null,null,null,null,null,null,null,null,null,{"$f":"IFERROR(IF($N$77>250,VLOOKUP(\"Reduzca el número de direcciones utilizadas\",Translations!$A$4:$E$209,MATCH('System Calculation'!$J$7,Translations!$A$1:$E$1,0),FALSE),IF($B$85>0.75,VLOOKUP(\"Trate de reducir el consumo ajustando la cantidad de dispositivos\",Translations!$A$4:$E$209,MATCH('System Calculation'!$J$7,Translations!$A$1:$E$1,0),FALSE),IF($B$107<$B$85,VLOOKUP(\"Trate de modificar los parámetros de cable y lazo\",Translations!$A$4:$E$209,MATCH('System Calculation'!$J$7,Translations!$A$1:$E$1,0),FALSE),\"\"))),VLOOKUP(\"Revise o rellene los datos de configuración de lazo\",Translations!$A$4:$E$209,MATCH('System Calculation'!$J$7,Translations!$A$1:$E$1,0),FALSE))","v":""},null,null,null,null,null,null,null,null,null,{"$f":"VLOOKUP(\"Esta es la distancia del último dispositivo al retorno del lazo\",Translations!$A$4:$E$209,MATCH('System Calculation'!$J$7,Translations!$A$1:$E$1,0),FALSE)","v":"This is the distance from the last device to the R of the loop"}]
[{"$f":"VLOOKUP(\"Topología de lazo\",Translations!$A$4:$E$209,MATCH('System Calculation'!$J$7,Translations!$A$1:$E$1,0),FALSE)","v":"Loop topology"},null,{"$f":"IFERROR(VLOOKUP(B14,Data!$D$45:$E$46,2,FALSE),\"ERROR\")","v":"ERROR"},null,{"$f":"IF($B$14=Data!D46,VLOOKUP(\"Lazo abierto. Toda la corriente en el mismo extremo del cable (peor caso)\",Translations!$A$4:$E$209,MATCH('System Calculation'!$J$7,Translations!$A$1:$E$1,0),FALSE),VLOOKUP(\"Lazo cerrado. Se divide la corriente por los dos extremos (mejor caso)\",Translations!$A$4:$E$209,MATCH('System Calculation'!$J$7,Translations!$A$1:$E$1,0),FALSE))","v":"Closed loop. The current is divided on both ends (best case)"},null,null,null,null,null,null,null,null,null,null,null,null,null,null,null,null,null,null,null,null,{"$f":"VLOOKUP(\"La topología de lazo hace referencia\",Translations!$A$4:$E$209,MATCH('System Calculation'!$J$7,Translations!$A$1:$E$1,0),FALSE)","v":"Loop topology takes into account whether the loop is closed in Class A, or the loop is in degraded mode due to an open loop fault "}]
[{"$f":"VLOOKUP(\"Factor de distribución\",Translations!$A$4:$E$209,MATCH('System Calculation'!$J$7,Translations!$A$1:$E$1,0),FALSE)","v":"Distribution factor"},1,{"$f":"VLOOKUP(B15,Data!$A$21:$B$49,2,FALSE)","v":0.56999999999999995},null,{"$f":"IF($B$15=1,VLOOKUP(\"Distribuidos equitativamente (mejor caso)\",Translations!$A$4:$E$209,MATCH('System Calculation'!$J$7,Translations!$A$1:$E$1,0),FALSE),IF($B$15=0,VLOOKUP(\"Todos en el mismo extremo del cable (peor caso)\",Translations!$A$4:$E$209,MATCH('System Calculation'!$J$7,Translations!$A$1:$E$1,0),FALSE),VLOOKUP(\"Caso intermedio\",Translations!$A$4:$E$209,MATCH('System Calculation'!$J$7,Translations!$A$1:$E$1,0),FALSE)))","v":"Equally distributed (best case)"},null,null,null,null,null,null,null,null,null,null,null,null,null,null,null,null,null,null,null,null,{"$f":"VLOOKUP(\"El factor de distribución hace referencia\",Translations!$A$4:$E$209,MATCH('System Calculation'!$J$7,Translations!$A$1:$E$1,0),FALSE)","v":"Distribution factor is an estimation of how equitative are the devices distributed along the loop, being 100% perfectly distributed"}]
{"$rows_left_out":100}
{"sheet":"External power supply","index":3,"n_rows":29,"n_cols":10,"rows_kept":29,"cut":false,"hidden":false,"merged":[[1,9,50,22],[6,3,6,6],[8,1,13,1],[1,1,1,7],[3,1,4,2],[3,3,4,7],[28,2,29,7],[28,1,29,1],[16,2,18,7],[16,1,18,1],[25,2,26,7],[25,1,26,1],[20,2,23,7],[20,1,23,1]]}
[]
[null,{"$f":"VLOOKUP(\"Fuente de alimentación externa\",Translations!$A$4:$E$209,MATCH('System Calculation'!$J$7,Translations!$A$1:$E$1,0),FALSE)","v":"External power supply"},null,null,null,null,null,null,null,{"$error":"#VALUE!"}]
[]
[null,{"$f":"VLOOKUP(\"Modo de uso\",Translations!$A$4:$E$209,MATCH('System Calculation'!$J$7,Translations!$A$1:$E$1,0),FALSE)","v":"Use mode"},null,{"$f":"VLOOKUP(\"Elegir fuente de alimentación según la capacidad de batería total requerida para la autonomía del sistema\",Translations!$A$4:$E$209,MATCH('System Calculation'!$J$7,Translations!$A$1:$E$1,0),FALSE)","v":"Choose the power supply depending on the total required battery capacity for the system autonomy"}]
[]
[]
[null,null,null,{"$f":"VLOOKUP(\"Fuentes de alimentación\",Translations!$A$4:$E$209,MATCH('System Calculation'!$J$7,Translations!$A$1:$E$1,0),FALSE)","v":"Power Supply Units"},null,null,null,{"$f":"VLOOKUP(\"Accesorio\",Translations!$A$4:$E$209,MATCH('System Calculation'!$J$7,Translations!$A$1:$E$1,0),FALSE)","v":"Accesory"}]
[null,null,null,"TUL500 EN","STX2405-E","STX2410-E","STX2410-H","BATT-BOX-65-BLACK"]
[null,{"$f":"VLOOKUP(\"Baterías\",Translations!$A$4:$E$209,MATCH('System Calculation'!$J$7,Translations!$A$1:$E$1,0),FALSE)","v":"Batteries"},"BTD-1207"]
[null,null,"BTD-1212"]
[null,null,"BTD-1218"]
[null,null,"BTD-1224"]
[null,null,"BTD-1244"]
[null,null,"BTD-12120"]
[]
{"$rows_left_out":15}
{"sheet":"Data","index":4,"n_rows":50,"n_cols":28,"rows_kept":50,"cut":false,"hidden":true,"merged":[]}
[]
["Características centrales",null,null,null,null,null,null,"Características baterías"]
["Central",null,"I_Reposo (A)","I_Alarma (A)","Imax (A)","Capacidad BAT max",null,null,"Voltaje (V)","Capacidad (Ah)",null,null,null,"TABLA AUXILIAR"]
["CAD-151-1 & CAD-150-1-Mini",{"$f":"N6","v":"CAD_151_1"},0.115,0.17899999999999999,2.6,12,null,"BTD-1207",12,7.2,120,"BTD-12120",null,"Centrales"]
["CAD-151-2",{"$f":"N7","v":"CAD_151_2"},0.14299999999999999,0.17899999999999999,2.6,12,null,"BTD-1212",12,12,44,"BTD-1244",null,null,{"$f":"N6","v":"CAD_151_1"},{"$f":"N7","v":"CAD_151_2"},{"$f":"N8","v":0},{"$f":"N9","v":0},{"$f":"N10","v":0},{"$f":"N11","v":0},{"$f":"N12","v":0},{"$f":"N13","v":0},{"$f":"N14","v":0},{"$f":"N15","v":0},{"$f":"N16","v":0},{"$f":"N17","v":0},{"$f":"N18","v":0},{"$f":"N19","v":0}]
[null,null,null,null,null,null,null,"BTD-1218",12,18,24,"BTD-1224",null,"CAD_151_1","BTD-1207","BTD-1207"]
[null,null,null,null,null,null,null,"BTD-1224",12,24,18,"BTD-1218",null,"CAD_151_2","BTD-1212","BTD-1212"]
[null,null,null,null,null,null,null,"BTD-1244",12,44,12,"BTD-1212"]
[null,null,null,null,null,null,null,"BTD-12120",12,120,7.2,"BTD-1207"]
[]
[null,null,null,null,null,null,null,"Características baterías"]
[null,null,null,null,null,null,null,"Cantidad tarjetas"]
[null,null,null,null,null,null,null,0]
[null,null,null,null,null,null,null,1]
[]
{"$rows_left_out":36}
{"sheet":"Translations","index":5,"n_rows":209,"n_cols":4,"rows_kept":209,"cut":false,"hidden":false,"merged":[]}
["Texto","Español","English","Your language"]
["Idioma","Idioma","Language"]
["Pulsar botón para reiniciar todos los valores e iniciar un nuevo proyecto","Pulsar botón para reiniciar todos los valores e iniciar un nuevo proyecto","Press the button to reset all the values and start a new project"]
["Tiempo respaldo baterías","Tiempo respaldo baterías","Battery backup time"]
["Tiempo en reposo","Tiempo en reposo","Standby time"]
["Tiempo en alarma","Tiempo en alarma","Alarm time"]
["Nota: los valores seleccionados no cumplen EN 54","Nota: los valores seleccionados no cumplen EN 54","Note: the values selected do not comply with EN 54"]
["Parámetros del sistema y baterías","Parámetros del sistema y baterías","Battery and system parameters"]
["Salida auxiliar 24 V central","Salida auxiliar 24 V central","Panel auxilliary 24 V output"]
["Salida sirenas 1","Salida sirenas 1","Sounder output 1"]
["Salida sirenas 2","Salida sirenas 2","Sounder output 2"]
["I_Total_Reposo","I_Total_Reposo","I_Total_Standby"]
["I_Total_Alarma","I_Total_Alarma","I_Total_Alarm"]
["Factor de degradación","Factor de degradación","Derating factor"]
["Batería seleccionada para la autonomía","Batería seleccionada para la autonomía","Battery selected for backup time"]
{"$rows_left_out":194}